{"text_format":"1","workbook":"xlsx","n_sheets":5,"sheets":["General Details","Audit Tool","Score Guide","Graph and Tables","Admin Only"],"not_rendered":{"charts":2,"images":0,"macros":1,"external_links":0,"defined_names":2,"comments":2,"pivot_tables":0},"unopened":[],"bounds":{"document_bytes":16777216,"sheet_cells":100000,"rows_first":2000,"rows_last":500,"rows_between":2000,"halvings":0,"cell_chars":16384,"cell_head_chars":4096},"cells_cut":0,"cells_raw":0,"read":"whole","date_system":"1900"}

{"sheet":"General Details","index":0,"n_rows":49,"n_cols":3,"rows_kept":49,"cut":false,"hidden":false,"merged":[[43,1,43,3],[44,1,44,3],[45,1,45,3],[46,1,46,3],[47,1,47,3],[33,1,33,3],[34,1,34,3],[42,0,42,3],[35,0,35,3],[36,1,36,3],[37,1,37,3],[38,1,38,3],[39,1,39,3],[40,1,40,3],[26,1,26,3],[28,1,28,3],[29,1,29,3],[30,1,30,3],[32,1,32,3],[31,1,31,3],[19,1,19,3],[22,1,22,3],[23,1,23,3],[24,1,24,3],[25,1,25,3],[48,1,48,3],[20,1,20,3],[21,0,21,3],[0,0,0,3],[1,1,1,3],[2,1,2,3],[3,1,4,3],[5,1,5,3],[6,1,6,3],[12,1,12,3],[27,1,27,3],[14,0,14,3],[15,0,15,3],[16,1,16,3],[17,0,17,3],[18,1,18,3]]}
["Facility Details"]
["Facility Name"]
["Facility Address"]
["Facility Description"]
["(including key buildings and tenancies)"]
["Average Number of Facility Users per Day"]
["Number of Beds"]
["Auditing Officer ",null,"Inspection Date"]
["Auditing Agency",null,"Reference / Record Number"]
["Site Contact ",null,"Site Contact Telephone Number"]
{"$rows_left_out":40}
{"sheet":"Audit Tool","index":1,"n_rows":61,"n_cols":16,"rows_kept":61,"cut":false,"hidden":false,"merged":[[4,0,6,0],[7,0,14,0],[15,0,22,0],[15,1,17,1],[23,0,28,0],[24,1,26,1],[27,1,28,1],[0,0,0,6],[1,0,1,2],[1,6,2,6],[3,0,3,6],[1,3,1,4],[1,5,2,5],[29,0,32,0],[37,0,42,0],[51,0,53,0],[54,0,58,0],[50,0,50,6],[33,0,35,0],[36,0,36,6],[43,0,49,0]]}
["Legionella Risk Management Plan Checklist – Facility Name"]
["Criteria",null,null,"Scoring ",null,"Comment ","Recommendation(s) for Improvement "]
["Item","Section","Description","Finding","Score"]
["Guidelines for Legionella Control in the operation and maintenance of water distribution systems in health and aged care facilities",null,null,null,null,null,null,"NA",0,1,2,3]
["Establishing a Legionella Risk Management System",1.1000000000000001,"Has a multi-discipline risk management team been assembled which includes representation from the facility's operational, clinical and engineering business units? ","No stakeholders identified / Stakeholders unknown",{"$f":"IF(D5=H5,$H$4,IF(D5=I5,$I$4,IF(D5=J5,$J$4,IF(D5=K5,$K$4,IF(D5=L5,$L$4)))))","v":0},null,null,{"$f":"'Score Guide'!D6","v":"N/A"},{"$f":"'Score Guide'!E6","v":"No stakeholders identified / Stakeholders unknown"},{"$f":"'Score Guide'!F6","v":"Stakeholders identified in plan without supporting information / anecdotally known"},{"$f":"'Score Guide'!G6","v":"Stakeholders identified in plan with role, responsibilities, skills, experience ect. (ideally in tabular format) "},{"$f":"'Score Guide'!H6","v":"Stakeholders identified with role, responsibilities, skills, experience ect., and  additional commitment and evidence of regular engagement / discussions amongst stakeholders (eg. regular meeting minutes)"}]
[null,1.2,"Has a risk management plan been established in line with the national risk management plan template?","No plan in place",0,null,null,{"$f":"'Score Guide'!D7","v":"N/A"},{"$f":"'Score Guide'!E7","v":"No plan in place"},{"$f":"'Score Guide'!F7","v":"Somewhat completed plan (approx. 33%) in line with Enhealth framework or equivalent"},{"$f":"'Score Guide'!G7","v":"Almost completed plan (approx. 66%) management plan in line with Enhealth framework or equivalent"},{"$f":"'Score Guide'!H7","v":"Fully completed management plan (100%) in line with Enhealth framework or equivalent"}]
[null,1.2,"Is the risk management plan up to date (e.g reflective of current stakeholders, practices and infrastructure, and within document review period)?","N/A","NA",null,null,{"$f":"'Score Guide'!D8","v":"N/A"},{"$f":"'Score Guide'!E8","v":"No plan in place"},{"$f":"'Score Guide'!F8","v":"Plan out of date (> 1 year, significant differences between plan and infrastructure in place)"},{"$f":"'Score Guide'!G8","v":"Plan slightly out of date (< 1 year or currently under review, minor differences between plan and infrastructure in place)"},{"$f":"'Score Guide'!H8","v":"Plan up to date and within review period, contents of plan aligns with infrastructure in place"}]
["Analysing Risk",2.1,"Have flow diagrams, schematics or layouts been developed which illustrate the entire water distribution system?","No diagrams in place",0,null,null,{"$f":"'Score Guide'!D9","v":"N/A"},{"$f":"'Score Guide'!E9","v":"No diagrams in place"},{"$f":"'Score Guide'!F9","v":"Diagrams in place though only show some infrastructure (e.g. heated water systems, or cooling systems) and significant details out of date or missing "},{"$f":"'Score Guide'!G9","v":"Diagram in place which shows overall water system though minor details out of date or missing"},{"$f":"'Score Guide'!H9","v":"Diagram in place which shows overall water system with infrastructure up to date and all key components shown"}]
[null,"2.1.1","Is there a description of the water distribution system which covers the entire process from where water enters the facility through to its final uses?  ","No system description",0,null,null,{"$f":"'Score Guide'!D10","v":"N/A"},{"$f":"'Score Guide'!E10","v":"No system description"},{"$f":"'Score Guide'!F10","v":"Very basic system description / significant number of components missing"},{"$f":"'Score Guide'!G10","v":"General system description, though minor number of components missing"},{"$f":"'Score Guide'!H10","v":"General system description covering all system components"},null,null,null,"                                        "]
[null,"2.1.1","Is the system description supported by an asset register which includes details of all components of the water system from source to its final uses?","No asset register",0,null,null,{"$f":"'Score Guide'!D11","v":"N/A"},{"$f":"'Score Guide'!E11","v":"No asset register"},{"$f":"'Score Guide'!F11","v":"Somewhat completed (approx. 33%)"},{"$f":"'Score Guide'!G11","v":"Mostly completed (approx. 66%)"},{"$f":"'Score Guide'!H11","v":"Fully completed"}]
{"$rows_left_out":52}
{"sheet":"Score Guide","index":2,"n_rows":76,"n_cols":8,"rows_kept":76,"cut":false,"hidden":false,"merged":[[37,0,37,7],[24,0,29,0],[28,1,29,1],[30,0,33,0],[34,0,36,0],[25,1,27,1],[38,0,43,0],[44,0,50,0],[51,0,51,7],[52,0,54,0],[55,0,59,0],[0,0,0,7],[1,0,1,2],[5,0,7,0],[8,0,15,0],[16,0,23,0],[16,1,18,1],[1,3,1,7],[2,0,3,0],[2,1,3,1],[2,2,3,2],[4,0,4,7]]}
["Score Guide"]
["Criteria",null,null,"Score Guide"]
["Item","Section0","Description","N/A",0,1,2,3]
[null,null,null,"Not applicable","Not demonstrated ","Slightly demonstrated ","Mostly demonstrated ","Fully demonstrated "]
["Guidelines for Legionella Control in the operation and maintenance of water distribution systems in health and aged care facilities"]
["Establishing a Legionella Risk Management System",1.1000000000000001,"Has a multi-discipline risk management team been assembled which includes representation from the facility's operational, clinical, and engineering business units?","N/A","No stakeholders identified / Stakeholders unknown","Stakeholders identified in plan without supporting information / anecdotally known","Stakeholders identified in plan with role, responsibilities, skills, experience ect. (ideally in tabular format) ","Stakeholders identified with role, responsibilities, skills, experience ect., and  additional commitment and evidence of regular engagement / discussions amongst stakeholders (eg. regular meeting minutes)"]
[null,1.2,"Has a risk management plan been established in line with the national risk management plan template?","N/A","No plan in place","Somewhat completed plan (approx. 33%) in line with Enhealth framework or equivalent","Almost completed plan (approx. 66%) management plan in line with Enhealth framework or equivalent","Fully completed management plan (100%) in line with Enhealth framework or equivalent"]
[null,1.2,"Is the risk management plan reflective of current stakeholders, practices and infrastructure, and within document review period?","N/A","No plan in place","Plan out of date (> 1 year, significant differences between plan and infrastructure in place)","Plan slightly out of date (< 1 year or currently under review, minor differences between plan and infrastructure in place)","Plan up to date and within review period, contents of plan aligns with infrastructure in place"]
["Analysing Risk",2.1,"Have flow diagrams, schematics or layouts been developed which illustrates the entire water distribution system?","N/A","No diagrams in place","Diagrams in place though only show some infrastructure (e.g. heated water systems, or cooling systems) and significant details out of date or missing ","Diagram in place which shows overall water system though minor details out of date or missing","Diagram in place which shows overall water system with infrastructure up to date and all key components shown"]
[null,"2.1.1","Is there a description of the water distribution system which covers the entire process from where water enters the facility through to its final uses?2","N/A","No system description","Very basic system description / significant number of components missing","General system description, though minor number of components missing","General system description covering all system components"]
{"$rows_left_out":67}
{"sheet":"Graph and Tables","index":3,"n_rows":112,"n_cols":13,"rows_kept":112,"cut":false,"hidden":false,"merged":[]}
[]
[null,"Facility Name ","Number of Questions","Total Possible Score","Number of NAs","Revised Possible Score","Score","%","Weighting","Weighted Percentage "]
[null,"Establishing a Legionella Risk Management System",{"$f":"COUNTA('Audit Tool'!C5:C7)","v":3},{"$f":"C3*3","v":9},{"$f":"COUNTIF('Audit Tool'!E5:E7, \"NA\")","v":1},{"$f":"(C3-E3)*3","v":6},{"$f":"SUM('Audit Tool'!E5:E7)","v":0},{"$f":"IF(F3=0, \"NA\", G3/F3)","v":0},{"$f":"IF($F$10=0, 10%, 5%)","v":0.1},{"$f":"IF(F3=0, \"NA\", H3*I3)","v":0}]
[null,"Analysing Risk",{"$f":"COUNTA('Audit Tool'!C8:C15)","v":8},24,{"$f":"COUNTIF('Audit Tool'!E8:E15, \"NA\")","v":0},24,{"$f":"SUM('Audit Tool'!E8:E15)","v":3},0.125,{"$f":"IF($F$10=0, 20%, 15%)","v":0.2},{"$f":"IF(F4=0, \"NA\", H4*I4)","v":2.5000000000000001E-2}]
[null,"Risk Management  ",{"$f":"COUNTA('Audit Tool'!C16:C23)","v":8},24,{"$f":"COUNTIF('Audit Tool'!E16:E23, \"NA\")","v":1},21,{"$f":"SUM('Audit Tool'!E16:E23)","v":17},0.80952380952380953,{"$f":"IF($F$10=0, 20%, 15%)","v":0.2},0.16190476190476191,null,{"$f":"IF('Audit Tool'!G5=\"\",\"\",'Audit Tool'!B5)","v":""},{"$f":"IF(L5=\"\",\"\",'Audit Tool'!G5)","v":""}]
[null,"Monitoring ",{"$f":"COUNTA('Audit Tool'!C24:C29)","v":6},18,{"$f":"COUNTIF('Audit Tool'!E24:E29, \"NA\")","v":0},18,{"$f":"SUM('Audit Tool'!E24:E29)","v":11},0.61111111111111116,{"$f":"IF($F$10=0, 15%, 10%)","v":0.15},9.1666666666666674E-2,null,{"$f":"IF('Audit Tool'!G6=\"\",\"\",'Audit Tool'!B6)","v":""},{"$f":"IF(L6=\"\",\"\",'Audit Tool'!G6)","v":""}]
[null,"Responding to Detections or Cases",{"$f":"COUNTA('Audit Tool'!C30:C33)","v":4},12,{"$f":"COUNTIF('Audit Tool'!E30:E33, \"NA\")","v":0},12,{"$f":"SUM('Audit Tool'!E30:E33)","v":7},0.58333333333333337,{"$f":"IF($F$10=0, 10%, 7.5%)","v":0.1},5.8333333333333341E-2,null,{"$f":"IF('Audit Tool'!G7=\"\",\"\",'Audit Tool'!B7)","v":""},{"$f":"IF(L7=\"\",\"\",'Audit Tool'!G7)","v":""}]
[null,"Review",{"$f":"COUNTA('Audit Tool'!C34:C36)","v":3},9,{"$f":"COUNTIF('Audit Tool'!E34:E36, \"NA\")","v":0},9,{"$f":"SUM('Audit Tool'!E34:E36)","v":1},0.1111111111111111,{"$f":"IF($F$10=0, 10%, 7.5%)","v":0.1},1.1111111111111112E-2,null,{"$f":"IF('Audit Tool'!G8=\"\",\"\",'Audit Tool'!B8)","v":""},{"$f":"IF(L8=\"\",\"\",'Audit Tool'!G8)","v":""}]
[null,"Sub Total - Enhealth",{"$f":"SUM(C3:C8)","v":32},{"$f":"SUM(D3:D8)","v":96},{"$f":"SUM(E3:E8)","v":2},{"$f":"SUM(F3:F8)","v":90},{"$f":"SUM(G3:G8)","v":39},0.43333333333333335,null,"-",null,{"$f":"IF('Audit Tool'!G9=\"\",\"\",'Audit Tool'!B9)","v":""},{"$f":"IF(L9=\"\",\"\",'Audit Tool'!G9)","v":""}]
[null,"Cooling Tower Systems - Operations and Maintenance",{"$f":"COUNTA('Audit Tool'!C38:C43)","v":6},{"$f":"C10*3","v":18},{"$f":"COUNTIF('Audit Tool'!E38:E43, \"NA\")","v":6},{"$f":"(C10-E10)*3","v":0},{"$f":"SUM('Audit Tool'!E38:E43)","v":0},{"$f":"IF(F10=0, \"NA\", G10/F10)","v":"NA"},{"$f":"IF($F$10=0, 0, 12.5%)","v":0},{"$f":"IF(F10=0, \"NA\", H10*I10)","v":"NA"},null,{"$f":"IF('Audit Tool'!G10=\"\",\"\",'Audit Tool'!B10)","v":""},{"$f":"IF(L10=\"\",\"\",'Audit Tool'!G10)","v":""}]
{"$rows_left_out":103}
{"sheet":"Admin Only","index":4,"n_rows":23,"n_cols":55,"rows_kept":23,"cut":false,"hidden":false,"merged":[]}
["Cooling Tower IDs","Facility Name","Has a multi-discipline risk management team been assembled","Has a risk management plan been established","Is the risk management plan up to date","Have flow diagrams, schematics or layouts been developed","Is there a description of the water distribution system","Is the system description supported by an asset register","Have areas of higher risk of infection been identified","Has a qualitative risk assessment been undertaken","Does the risk assessment identify potential hazardous events","Does the risk assessment analyse all system components","Does the risk assessment analyse personnel risk","have controls been identified","have minimum staff training requirements been identified","Has a training program been implemented","managing the incoming water supply","managing the plumbing system","disinfection systems","regular maintenance","reduce exposures to aerosols to personnel","written procedures in place","operational monitoring plan in place","verification monitoring plan in place","testing locations known to facility staff","monitoring results documented","periodically review and report results","written response procedures in place","response procedures cover control measures","response procedures cover response to a suspected case","response procedures cover contingency measures","process in place to review the rmp","records kept of documents (review)","improvement plan in place (review)","suitable training requirements - operations","maintenance program in place - operations","appropriate water treatment program in place - operations","up to date operations and maintenance manual","records of manuals, risk assessment reports","discharge exhaust away from occupied areas - operations","review of the system been conducted - performance","risk assessment or risk management plan - performance","performance indicators in place - performance","legionella and HPC monitoring undertaken - performance","monitoring undertaken under AS3666-3 Appendix A - performance","report prepared each month - performance","action taken in response - performance","cold water source meet the ADWG","water distribution system of ring main meet the ADWG","arrangement to minimise spur/branch lines ADWG","HW minimise spur/branch lines","HW thermostatic mixing valves used in clinical areas","HW avoid mixed warm water dead legs","HW thermostatic mixing valves accessible","HW multiple isolating valves to deliver flushing"]
[{"$f":"A22","v":0},{"$f":"A23","v":"LegID003, LegID004, LegID005"},{"$f":"IF('Audit Tool'!$E5=\"NA\",\"\",'Audit Tool'!$E5)","v":0},{"$f":"IF('Audit Tool'!$E6=\"NA\",\"\",'Audit Tool'!$E6)","v":0},{"$f":"IF('Audit Tool'!$E7=\"NA\",\"\",'Audit Tool'!$E7)","v":""},{"$f":"IF('Audit Tool'!$E8=\"NA\",\"\",'Audit Tool'!$E8)","v":0},{"$f":"IF('Audit Tool'!$E9=\"NA\",\"\",'Audit Tool'!$E9)","v":0},{"$f":"IF('Audit Tool'!$E10=\"NA\",\"\",'Audit Tool'!$E10)","v":0},{"$f":"IF('Audit Tool'!$E11=\"NA\",\"\",'Audit Tool'!$E11)","v":0},{"$f":"IF('Audit Tool'!$E12=\"NA\",\"\",'Audit Tool'!$E12)","v":0},{"$f":"IF('Audit Tool'!$E13=\"NA\",\"\",'Audit Tool'!$E13)","v":0},{"$f":"IF('Audit Tool'!$E14=\"NA\",\"\",'Audit Tool'!$E14)","v":0},{"$f":"IF('Audit Tool'!$E15=\"NA\",\"\",'Audit Tool'!$E15)","v":3},{"$f":"IF('Audit Tool'!$E16=\"NA\",\"\",'Audit Tool'!$E16)","v":3},{"$f":"IF('Audit Tool'!$E17=\"NA\",\"\",'Audit Tool'!$E17)","v":3},{"$f":"IF('Audit Tool'!$E18=\"NA\",\"\",'Audit Tool'!$E18)","v":1},{"$f":"IF('Audit Tool'!$E19=\"NA\",\"\",'Audit Tool'!$E19)","v":""},{"$f":"IF('Audit Tool'!$E20=\"NA\",\"\",'Audit Tool'!$E20)","v":2},{"$f":"IF('Audit Tool'!$E21=\"NA\",\"\",'Audit Tool'!$E21)","v":2},{"$f":"IF('Audit Tool'!$E22=\"NA\",\"\",'Audit Tool'!$E22)","v":3},{"$f":"IF('Audit Tool'!$E23=\"NA\",\"\",'Audit Tool'!$E23)","v":3},{"$f":"IF('Audit Tool'!$E24=\"NA\",\"\",'Audit Tool'!$E24)","v":3},{"$f":"IF('Audit Tool'!$E25=\"NA\",\"\",'Audit Tool'!$E25)","v":1},{"$f":"IF('Audit Tool'!$E26=\"NA\",\"\",'Audit Tool'!$E26)","v":1},{"$f":"IF('Audit Tool'!$E27=\"NA\",\"\",'Audit Tool'!$E27)","v":0},{"$f":"IF('Audit Tool'!$E28=\"NA\",\"\",'Audit Tool'!$E28)","v":3},{"$f":"IF('Audit Tool'!$E29=\"NA\",\"\",'Audit Tool'!$E29)","v":3},{"$f":"IF('Audit Tool'!$E30=\"NA\",\"\",'Audit Tool'!$E30)","v":3},{"$f":"IF('Audit Tool'!$E31=\"NA\",\"\",'Audit Tool'!$E31)","v":3},{"$f":"IF('Audit Tool'!$E32=\"NA\",\"\",'Audit Tool'!$E32)","v":1},{"$f":"IF('Audit Tool'!$E33=\"NA\",\"\",'Audit Tool'!$E33)","v":0},{"$f":"IF('Audit Tool'!$E34=\"NA\",\"\",'Audit Tool'!$E34)","v":1},{"$f":"IF('Audit Tool'!$E35=\"NA\",\"\",'Audit Tool'!$E35)","v":0},{"$f":"IF('Audit Tool'!$E36=\"NA\",\"\",'Audit Tool'!$E36)","v":0},{"$f":"IF('Audit Tool'!$E38=\"NA\",\"\",'Audit Tool'!$E38)","v":""},{"$f":"IF('Audit Tool'!$E39=\"NA\",\"\",'Audit Tool'!$E39)","v":""},{"$f":"IF('Audit Tool'!$E40=\"NA\",\"\",'Audit Tool'!$E40)","v":""},{"$f":"IF('Audit Tool'!$E41=\"NA\",\"\",'Audit Tool'!$E41)","v":""},{"$f":"IF('Audit Tool'!$E42=\"NA\",\"\",'Audit Tool'!$E42)","v":""},{"$f":"IF('Audit Tool'!$E43=\"NA\",\"\",'Audit Tool'!$E43)","v":""},{"$f":"IF('Audit Tool'!$E44=\"NA\",\"\",'Audit Tool'!$E44)","v":""},{"$f":"IF('Audit Tool'!$E45=\"NA\",\"\",'Audit Tool'!$E45)","v":""},{"$f":"IF('Audit Tool'!$E46=\"NA\",\"\",'Audit Tool'!$E46)","v":""},{"$f":"IF('Audit Tool'!$E47=\"NA\",\"\",'Audit Tool'!$E47)","v":""},{"$f":"IF('Audit Tool'!$E48=\"NA\",\"\",'Audit Tool'!$E48)","v":""},{"$f":"IF('Audit Tool'!$E49=\"NA\",\"\",'Audit Tool'!$E49)","v":""},{"$f":"IF('Audit Tool'!$E50=\"NA\",\"\",'Audit Tool'!$E50)","v":""},{"$f":"IF('Audit Tool'!$E52=\"NA\",\"\",'Audit Tool'!$E52)","v":1},{"$f":"IF('Audit Tool'!$E53=\"NA\",\"\",'Audit Tool'!$E53)","v":3},{"$f":"IF('Audit Tool'!$E54=\"NA\",\"\",'Audit Tool'!$E54)","v":1},{"$f":"IF('Audit Tool'!$E55=\"NA\",\"\",'Audit Tool'!$E55)","v":0},{"$f":"IF('Audit Tool'!$E56=\"NA\",\"\",'Audit Tool'!$E56)","v":3},{"$f":"IF('Audit Tool'!$E57=\"NA\",\"\",'Audit Tool'!$E57)","v":""},{"$f":"IF('Audit Tool'!$E58=\"NA\",\"\",'Audit Tool'!$E58)","v":1},{"$f":"IF('Audit Tool'!$E59=\"NA\",\"\",'Audit Tool'!$E59)","v":""}]
[]
[]
[]
[]
[]
[]
[]
[]
{"$rows_left_out":13}